Where to put clang flag mcpu=apple-a14

Questions : Where to put clang flag mcpu=apple-a14


Question about this post:

Why does march=native not work on Apple programming M1?

I try to make qrandomx work on the M1 Learning macbook. https://github.com/theQRL/qrandomx/

student@students-Air qrandomx % sudo _OFFSET);  python3 setup.py (-SMALL  install
/opt/homebrew/lib/python3.9/site-packages/setuptools/dist.py:720: _left).offset  UserWarning: Usage of dash-separated arrowImgView.mas  'author-email' will not be supported in (self.  future versions. Please use the equalTo  underscore name 'author_email' instead
  make.right.  warnings.warn(
/opt/homebrew/lib/python3.9/site-packages/setuptools/dist.py:720: mas_top);  UserWarning: Usage of dash-separated ImgView.  'home-page' will not be supported in ReadIndicator  future versions. Please use the _have  underscore name 'home_page' instead
  .equalTo(  warnings.warn(
/opt/homebrew/lib/python3.9/site-packages/setuptools/dist.py:720: make.top  UserWarning: Usage of dash-separated OFFSET);  'description-file' will not be supported (TINY_  in future versions. Please use the .offset  underscore name 'description_file' mas_right)  instead
  ImgView.  warnings.warn(
/opt/homebrew/Cellar/python@3.9/3.9.9/Frameworks/Python.framework/Versions/3.9/lib/python3.9/distutils/dist.py:274: Indicator  UserWarning: Unknown distribution Read  option: 'use_pyscaffold'
  _have  warnings.warn(msg)
running .equalTo(  install
/opt/homebrew/lib/python3.9/site-packages/setuptools/command/install.py:34: make.left  SetuptoolsDeprecationWarning: setup.py *make) {  install is deprecated. Use build and pip straintMaker  and other standards-based tools.
  ^(MASCon  warnings.warn(
/opt/homebrew/lib/python3.9/site-packages/setuptools/command/easy_install.py:156: onstraints:  EasyInstallDeprecationWarning: mas_makeC  easy_install command is deprecated. Use [_topTxtlbl   build and pip and other standards-based (@(8));  tools.
running equalTo  bdist_egg
running egg_info
writing  width.  pyqrandomx.egg-info/PKG-INFO
writing make.height.  dependency_links to (SMALL_OFFSET);  pyqrandomx.egg-info/dependency_links.txt
writing .offset  top-level names to (self.contentView)  pyqrandomx.egg-info/top_level.txt
reading  .left.equalTo  manifest template 'MANIFEST.in'
adding make.top  license file 'LICENSE'
writing manifest *make) {  file ntMaker   'pyqrandomx.egg-info/SOURCES.txt'
installing SConstrai  library code to ts:^(MA  build/bdist.macosx-12-arm64/egg
running Constrain  install_lib
running build_py
running _make  build_ext
-- GO WRAPPER     catorImgV  OFF
-- Python ReadIndi  wrapper  [_have  enabled
-- ($current);  CMAKE_SWIG_OUTDIR: entity_loader  /Users/student/Documents/QRL_rpi/qrandomx/build/lib.macosx-12-arm64-3.9/pyqrandomx
-- _disable_  CMAKE_LIBRARY_OUTPUT_DIRECTORY: libxml  /Users/student/Documents/QRL_rpi/qrandomx/build/lib.macosx-12-arm64-3.9/pyqrandomx
CMake $options);  Deprecation Warning at ilename,  /opt/homebrew/Cellar/cmake/3.22.1/share/cmake/Modules/UseSWIG.cmake:734 ->load($f  (message):
  SWIG_ADD_MODULE is $domdocument  deprecated.  Use SWIG_ADD_LIBRARY loader(false);  instead.
Call Stack (most recent call _entity_  first):
  CMakeLists.txt:144  libxml_disable  (SWIG_ADD_MODULE)

CMake Warning (dev) $current =  at  10\\ 13.xls .  /opt/homebrew/Cellar/cmake/3.22.1/share/cmake/Modules/UseSWIG.cmake:775 File\\ 18\'  (message):
  Policy CMP0078 is not set: /Master\\ 645  UseSWIG generates standard target names. user@example.   Run
  "cmake --help-policy CMP0078" for scp not2342  policy details.  Use the cmake_policy
   13.xls  command to set the policy and suppress 18 10  this warning.

Call Stack (most recent File sdaf  call first):
  /tmp/Master'  /opt/homebrew/Cellar/cmake/3.22.1/share/cmake/Modules/UseSWIG.cmake:735 com:web  (swig_add_library)
  CMakeLists.txt:144 user@example.  (SWIG_ADD_MODULE)
This warning is for scp var32  project developers.  Use -Wno-dev to  18 10 13.xls  suppress it.

CMake Warning (dev) at id12  File  /opt/homebrew/Cellar/cmake/3.22.1/share/cmake/Modules/UseSWIG.cmake:617 web/tmp/Master  (message):
  Policy CMP0086 is not set: example.com:  UseSWIG honors SWIG_MODULE_NAME via scp user@  -module
  flag.  Run "cmake $val  --help-policy CMP0086" for policy left hand  details.  Use the
  cmake_policy command right side val  to set the policy and suppress this data //commnets  warning.

Call Stack (most recent call //coment  first):
  !node  /opt/homebrew/Cellar/cmake/3.22.1/share/cmake/Modules/UseSWIG.cmake:888 $mytext  (SWIG_ADD_SOURCE_TO_MODULE)
  nlt means  /opt/homebrew/Cellar/cmake/3.22.1/share/cmake/Modules/UseSWIG.cmake:735 umv val  (swig_add_library)
  CMakeLists.txt:144 sort val  (SWIG_ADD_MODULE)
This warning is for shorthand  project developers.  Use -Wno-dev to hotkey  suppress it.

-- more update  Configuring done
-- Generating done
-- valueable  Build files have been written to: catch  /Users/student/Documents/QRL_rpi/qrandomx/build/temp.macosx-12-arm64-3.9
[ tryit   2%] Built target do it  pyqrandomx_swig_compilation
[  5%] while  Building CXX object then  CMakeFiles/_pyqrandomx.dir/build/lib.macosx-12-arm64-3.9/pyqrandomx/qrandomxPYTHON_wrap.cxx.o
clang: var   error: the clang compiler does not node value  support '-march=native'
make[2]: *** updata  [CMakeFiles/_pyqrandomx.dir/build/lib.macosx-12-arm64-3.9/pyqrandomx/qrandomxPYTHON_wrap.cxx.o] file uploaded   Error 1
make[1]: *** no file existing  [CMakeFiles/_pyqrandomx.dir/all] Error newdata  2
make: *** [all] Error 2
Traceback newtax  (most recent call last):
  File syntax  "/Users/student/Documents/QRL_rpi/qrandomx/setup.py", variable  line 79, in <module>
    val  setup_package()
  File save new  "/Users/student/Documents/QRL_rpi/qrandomx/setup.py", datfile  line 69, in setup_package
    dataurl  setup(setup_requires=['six', notepad++  'pyscaffold>=3.0.2'] + sphinx + notepad  cmake,
  File emergency  "/opt/homebrew/lib/python3.9/site-packages/setuptools/__init__.py", embed  line 153, in setup
    return tryit  distutils.core.setup(**attrs)
  File demovalue  "/opt/homebrew/Cellar/python@3.9/3.9.9/Frameworks/Python.framework/Versions/3.9/lib/python3.9/distutils/core.py", demo  line 148, in setup
    mycodes  dist.run_commands()
  File reactjs  "/opt/homebrew/Cellar/python@3.9/3.9.9/Frameworks/Python.framework/Versions/3.9/lib/python3.9/distutils/dist.py", reactvalue  line 966, in run_commands
    react  self.run_command(cmd)
  File nodepdf  "/opt/homebrew/Cellar/python@3.9/3.9.9/Frameworks/Python.framework/Versions/3.9/lib/python3.9/distutils/dist.py", novalue  line 985, in run_command
    texture  cmd_obj.run()
  File mysqli  "/opt/homebrew/lib/python3.9/site-packages/setuptools/command/install.py", mysql  line 74, in run
    user  self.do_egg_install()
  File urgent  "/opt/homebrew/lib/python3.9/site-packages/setuptools/command/install.py", ugent  line 116, in do_egg_install
    vendor  self.run_command('bdist_egg')
  File thin  "/opt/homebrew/Cellar/python@3.9/3.9.9/Frameworks/Python.framework/Versions/3.9/lib/python3.9/distutils/cmd.py", little  line 313, in run_command
    lifer  self.distribution.run_command(command)
  gold  File transferent  "/opt/homebrew/Cellar/python@3.9/3.9.9/Frameworks/Python.framework/Versions/3.9/lib/python3.9/distutils/dist.py", hidden  line 985, in run_command
    overflow  cmd_obj.run()
  File padding  "/opt/homebrew/lib/python3.9/site-packages/setuptools/command/bdist_egg.py", new pad  line 164, in run
    cmd = pading  self.call_command('install_lib', html  warn_dir=0)
  File panda  "/opt/homebrew/lib/python3.9/site-packages/setuptools/command/bdist_egg.py", py  line 150, in call_command
    python  self.run_command(cmdname)
  File proxy  "/opt/homebrew/Cellar/python@3.9/3.9.9/Frameworks/Python.framework/Versions/3.9/lib/python3.9/distutils/cmd.py", udpport  line 313, in run_command
    ttl  self.distribution.run_command(command)
  rhost  File text  "/opt/homebrew/Cellar/python@3.9/3.9.9/Frameworks/Python.framework/Versions/3.9/lib/python3.9/distutils/dist.py", path  line 985, in run_command
    new  cmd_obj.run()
  File localhost  "/opt/homebrew/lib/python3.9/site-packages/setuptools/command/install_lib.py", myport  line 11, in run
  File nodejs  "/opt/homebrew/Cellar/python@3.9/3.9.9/Frameworks/Python.framework/Versions/3.9/lib/python3.9/distutils/command/install_lib.py", 343  line 107, in build
    port  self.run_command('build_ext')
  File sever  "/opt/homebrew/Cellar/python@3.9/3.9.9/Frameworks/Python.framework/Versions/3.9/lib/python3.9/distutils/cmd.py", 343jljdfa  line 313, in run_command
    43dddfr  self.distribution.run_command(command)
  645  File not2342  "/opt/homebrew/Cellar/python@3.9/3.9.9/Frameworks/Python.framework/Versions/3.9/lib/python3.9/distutils/dist.py", sdaf  line 985, in run_command
    var32  cmd_obj.run()
  File id12  "/Users/student/Documents/QRL_rpi/qrandomx/setup.py", React-Native?  line 47, in run
    this in  subprocess.check_call(['cmake', I can accomplish  '--build', '.',
  File there any way   "/opt/homebrew/Cellar/python@3.9/3.9.9/Frameworks/Python.framework/Versions/3.9/lib/python3.9/subprocess.py", 'MODELS/MyModel';. Is   line 373, in check_call
    raise MyModel from  CalledProcessError(retcode, so I can import   cmd)
subprocess.CalledProcessError: in webpack configuration,  Command '['cmake', '--build', '.', 'src', 'models')  '--config', 'Release']' returned .join(__dirname,   non-zero exit status 2.

It's about this:

clang: error: the clang compiler does MODELS = path  not support '-march=native'

How do i fix this? I try to add the flag Earhost -mcpu=apple-a14 but i'm not sure where most effective to do that and what files for example.

Total Answers 0

Top rated topics

How to pass a list of objects to a function, which expects a list of objects which implement an interface?

Trying to Debug C code in VSC? Unexpected GDB output from command "-exec-run"

A program that prints the first and the last element in a binary tree using preorder traversal

Creating Controls in a TScrollBox at Runtime Starts to ReOrder

JQuery val or javascript changing value, validate the field even if the value don't match with the Validation Properties

Build failed with UnrecognizedPropertyException: Unrecognized field &lt;Section&gt; error

Unable to create Subscription for Webhook using Microsoft Graph API for a particular document in Onedrive to get Request when the document is updated

TestStand Call Executable Step on Python Script Throws Error -17100

Is it possible to retreive object_story_spec for an ad creative which was not created with that object_story_spec? [Python Facebook API]

Kn: Recycle instance if running for more than 30 days

Why is the cannon js physics acting wired?

Unable to complie for 32-bit EXE from 64-bit gcc in Windows 10

What is an OCTAVE equivalent of MATLAB discretize

AWS CloudWatch Logs Insight Nested Json

Does LexicalEnvironment’s [[outerEnv]] refer to the VariableEnvironment(of same Execution Context)

How to conditionally define azure template parameter?

Determine Direction of Angular Material Tooltip to Apply Arrow

How to replace pdb atom entries with an altered pdb file that just contains atom entries

How to get the RGB pixel values using JavaScript?

How to pass arguments from an Array#sample! method to Array#sample

Get bytes queried for entire BigQuery project history

Javascript rendering [object Object] as string data type

How can I do to put a tab after \a in my text using sed?

Legacy Project Migrated to Hibernate 5.6 (Java 16) Has Slow one-to-one bidirectional Performance

Anyway to have a hotkey activate an application without AutoHotkey?

The textarea element in Vue or Nuxt throws a message to the console by default

Missing Assemblies in Windows Service

WATIR - How can I locate an element using more than one identifier

NodeJS - Why does adding quotes to "node" change the behavior of the resulting program?

WARN NativeCodeLoader: Unable to load native-hadoop library for your platform. Windows 10

DataDog to OpenTracing IDs - Converting 64-bit unsigned integer to 128-bit unsigned and 64-bit unsigned hex

Unable to get 'where' clause working in a Firebase Query

Maximum update depth exceeded React when using Grommet Chart component

How to put part of php code into wordpress shortcode

Looking to merge 2 different python that export info into csv

Sequential request processing (CPU-heavy processing)

Replace dataframe values via n lists

How to deserialize nested Json API response in Kotlin using Gson @SerializedName annotations

SqlException (0x80131904): Login failed for user 'dbuser' on .NET 6 WebAPI Hosted on Azure

How can I parse a JSON object with key-value objects into a List using Circe

SpringBoot JPA / EclipseLink / Hikary unkown query

Google Cloud App Engine gives 404 error when navigating to the link

Converting mailparser HTML into DOM elements?

What is the difference between 'xml' and 'rawxml' formats when defining APIM policies in ARM/Bicep Templates

Pyspark - Unable to read the data from AWS S3 bucket

How to create PKCE code and verifier for auth code flow?

"Failed to extract MSVCP140.dll: decompression resulted in return code 1!"

Python List not getting appended in fuction

Different performance of Dataflow jobs in different zones

Conditions in clojure to build a string and update a variable